quartz-n
type: LexicalEntry
canonical form: quartz
sense: 14717894-n
part of speech: noun

14717894-n
type: LexicalConcept
in scheme: en-word.net
definition: a hard glossy mineral consisting of silicon dioxide in crystal form; present in most rocks (especially sandstone and granite); yellow sand is quartz with iron oxide impurities
ili: i114203
lexfile: noun.substance
part of speech: noun
hypernym: 14686753-n
mero substance: 14678720-n
mero substance: 15065844-n