ore-n
type: LexicalEntry
canonical form: ore
sense: 14712661-n
part of speech: noun

14712661-n
type: LexicalConcept
in scheme: en-word.net
definition: a mineral that contains metal that is valuable enough to be mined
ili: i114170
lexfile: noun.substance
part of speech: noun
hypernym: 14686753-n