coke-n
type: LexicalEntry
canonical form: coke
sense: 14709929-n
part of speech: noun

14709929-n
type: LexicalConcept
in scheme: en-word.net
definition: carbon fuel produced by distillation of coal
ili: i114156
lexfile: noun.substance
part of speech: noun
hypernym: 14899228-n