molecule-n
type: LexicalEntry
canonical form: molecule
sense: 14706294-n
part of speech: noun

14706294-n
type: LexicalConcept
in scheme: en-word.net
definition: (physics and chemistry) the simplest structural unit of an element or compound
ili: i114134
lexfile: noun.substance
part of speech: noun
domain topic: 06100457-n
domain topic: 06094057-n
hypernym: 09488589-n
mero part: 09263527-n
mero part: 14643403-n
mero part: 14645624-n