alloy-n
type: LexicalEntry
canonical form: alloy
sense: 14610949-n
part of speech: noun

metal-n
type: LexicalEntry
canonical form: metal
sense: 14610949-n
part of speech: noun

14610949-n
type: LexicalConcept
in scheme: en-word.net
definition: a mixture containing two or more metallic elements or metallic and nonmetallic elements usually fused together or dissolving into each other when molten
example: brass is an alloy of zinc and copper
ili: i113678
lexfile: noun.substance
part of speech: noun
hypernym: 14610438-n
mero substance: 15076272-n