deterioration-n
type: LexicalEntry
canonical form: deterioration
sense: 14585210-n
part of speech: noun

impairment-n
type: LexicalEntry
canonical form: impairment
sense: 14585210-n
part of speech: noun

14585210-n
type: LexicalConcept
in scheme: en-word.net
definition: a symptom of reduced quality or strength
ili: i113533
lexfile: noun.state
part of speech: noun
hypernym: 14584204-n