putrefaction-n
type: LexicalEntry
canonical form: putrefaction
sense: 14584518-n
part of speech: noun

rot-n
type: LexicalEntry
canonical form: rot
sense: 14584518-n
part of speech: noun

14584518-n
type: LexicalConcept
in scheme: en-word.net
definition: a state of decay usually accompanied by an offensive odor
ili: i113529
lexfile: noun.state
part of speech: noun
hypernym: 14584204-n