danger-n
type: LexicalEntry
canonical form: danger
sense: 14564367-n
part of speech: noun

14564367-n
type: LexicalConcept
in scheme: en-word.net
definition: the condition of being susceptible to harm or injury
example: you are in no danger
example: there was widespread danger of disease
ili: i113417
lexfile: noun.state
part of speech: noun
hypernym: 13943868-n