irritation-n
type: LexicalEntry
canonical form: irritation
sense: 14554994-n
part of speech: noun

14554994-n
type: LexicalConcept
in scheme: en-word.net
definition: (pathology) abnormal sensitivity to stimulation
example: any food produced irritation of the stomach
ili: i113366
lexfile: noun.state
part of speech: noun
domain topic: 06070395-n
hypernym: 14525310-n
hypernym: 14555585-n