indemnity-n
type: LexicalEntry
canonical form: indemnity
sense: 14553010-n
part of speech: noun

14553010-n
type: LexicalConcept
in scheme: en-word.net
definition: legal exemption from liability for damages
ili: i113355
lexfile: noun.state
part of speech: noun
hypernym: 14552475-n