immunity-n
type: LexicalEntry
canonical form: immunity
sense: 14550773-n
part of speech: noun

resistance-n
type: LexicalEntry
canonical form: resistance
sense: 14550773-n
part of speech: noun

14550773-n
type: LexicalConcept
in scheme: en-word.net
definition: (medicine) the condition in which an organism can resist disease
ili: i113344
lexfile: noun.state
part of speech: noun
domain topic: 06052606-n
hypernym: 13943868-n