ease-n
type: LexicalEntry
canonical form: ease
sense: 14515473-n
part of speech: noun

comfort-n
type: LexicalEntry
canonical form: comfort
sense: 14515473-n
part of speech: noun

14515473-n
type: LexicalConcept
in scheme: en-word.net
definition: a freedom from financial difficulty that promotes a comfortable state
example: a life of luxury and ease
example: he had all the material comforts of this world
ili: i113159
lexfile: noun.state
part of speech: noun
hypernym: 14515209-n