hearing-n
type: LexicalEntry
canonical form: hearing
sense: 14508362-n
part of speech: noun

audience-n
type: LexicalEntry
canonical form: audience
sense: 14508362-n
part of speech: noun

14508362-n
type: LexicalConcept
in scheme: en-word.net
definition: an opportunity to state your case and be heard
example: they condemned him without a hearing
example: he saw that he had lost his audience
ili: i113118
lexfile: noun.state
part of speech: noun
hypernym: 14507501-n