bankruptcy-n
type: LexicalEntry
canonical form: bankruptcy
sense: 14502268-n
part of speech: noun

14502268-n
type: LexicalConcept
in scheme: en-word.net
definition: a state of complete lack of some abstract property
example: spiritual bankruptcy
example: moral bankruptcy
example: intellectual bankruptcy
ili: i113091
lexfile: noun.state
part of speech: noun
hypernym: 14501461-n