solidity-n
type: LexicalEntry
canonical form: solidity
sense: 14475908-n
part of speech: noun

14475908-n
type: LexicalConcept
in scheme: en-word.net
definition: state of having the interior filled with matter
ili: i112956
lexfile: noun.state
part of speech: noun
attribute: https://en-word.net/synset/02271436-a
attribute: https://en-word.net/synset/02271738-a
hypernym: 14475377-n