wreck-n
type: LexicalEntry
canonical form: wreck
sense: 14447274-n
part of speech: noun

14447274-n
type: LexicalConcept
in scheme: en-word.net
definition: something or someone that has suffered ruin or dilapidation
example: the house was a wreck when they bought it
example: thanks to that quack I am a human wreck
ili: i112802
lexfile: noun.state
part of speech: noun
hypernym: 14445892-n