consistency-n
type: LexicalEntry
canonical form: consistency
sense: 14444184-n
part of speech: noun

14444184-n
type: LexicalConcept
in scheme: en-word.net
definition: logical coherence and accordance with the facts
example: a rambling argument that lacked any consistency
ili: i112787
lexfile: noun.state
part of speech: noun
hypernym: 14443868-n