alliance-n
type: LexicalEntry
canonical form: alliance
sense: 14442226-n
part of speech: noun

confederation-n
type: LexicalEntry
canonical form: confederation
sense: 14442226-n
part of speech: noun

14442226-n
type: LexicalConcept
in scheme: en-word.net
definition: the state of being allied or confederated
ili: i112778
lexfile: noun.state
part of speech: noun
hypernym: 14442066-n