fascination-n
type: LexicalEntry
canonical form: fascination
sense: 14431303-n
part of speech: noun

captivation-n
type: LexicalEntry
canonical form: captivation
sense: 14431303-n
part of speech: noun

14431303-n
type: LexicalConcept
in scheme: en-word.net
definition: the state of being intensely interested (as by awe or terror)
ili: i112723
lexfile: noun.state
part of speech: noun
hypernym: 14430940-n