tailspin-n
type: LexicalEntry
canonical form: tailspin
sense: 14427446-n
part of speech: noun

14427446-n
type: LexicalConcept
in scheme: en-word.net
definition: loss of emotional control often resulting in emotional collapse
ili: i112699
lexfile: noun.state
part of speech: noun
hypernym: 14426511-n