hydrophobia-n
type: LexicalEntry
canonical form: hydrophobia
sense: 14407029-n
part of speech: noun

14407029-n
type: LexicalConcept
in scheme: en-word.net
definition: a symptom of rabies in humans consisting of an aversion to swallowing liquids
ili: i112592
lexfile: noun.state
part of speech: noun
hypernym: 14323139-n