stitch-n
type: LexicalEntry
canonical form: stitch
sense: 14355744-n
part of speech: noun

14355744-n
type: LexicalConcept
in scheme: en-word.net
definition: a sharp spasm of pain in the side resulting from running
ili: i112278
lexfile: noun.state
part of speech: noun
hypernym: 14346126-n