eruption-n
type: LexicalEntry
canonical form: eruption
sense: 14344896-n
part of speech: noun

14344896-n
type: LexicalConcept
in scheme: en-word.net
definition: symptom consisting of a breaking out and becoming visible
ili: i112211
lexfile: noun.state
part of speech: noun
hypernym: 14323139-n