hematuria-n
type: LexicalEntry
canonical form: hematuria
sense: 14337747-n
part of speech: noun

haematuria-n
type: LexicalEntry
canonical form: haematuria
sense: 14337747-n
part of speech: noun

14337747-n
type: LexicalConcept
in scheme: en-word.net
definition: the presence of blood in the urine; often a symptom of urinary tract disease
ili: i112168
lexfile: noun.state
part of speech: noun
hypernym: 14323139-n