trauma-n
type: LexicalEntry
canonical form: trauma
sense: 14308778-n
part of speech: noun

psychic trauma-n
type: LexicalEntry
canonical form: psychic trauma
sense: 14308778-n
part of speech: noun

14308778-n
type: LexicalConcept
in scheme: en-word.net
definition: an emotional wound or shock often having long-lasting effects
ili: i112023
lexfile: noun.state
part of speech: noun
hypernym: 14396987-n