saddle sore-n
type: LexicalEntry
canonical form: saddle sore
sense: 14298742-n
part of speech: noun

gall-n
type: LexicalEntry
canonical form: gall
sense: 14298742-n
part of speech: noun

14298742-n
type: LexicalConcept
in scheme: en-word.net
definition: an open sore on the back of a horse caused by ill-fitting or badly adjusted saddle
ili: i111960
lexfile: noun.state
part of speech: noun
hypernym: 14276606-n