aminoaciduria-n
type: LexicalEntry
canonical form: aminoaciduria
sense: 14289670-n
part of speech: noun

14289670-n
type: LexicalConcept
in scheme: en-word.net
definition: abnormal presence of amino acids in the urine; usually a symptom of metabolic defects
ili: i111904
lexfile: noun.state
part of speech: noun
hypernym: 14323139-n