collapse-n
type: LexicalEntry
canonical form: collapse
sense: 14089685-n
part of speech: noun

prostration-n
type: LexicalEntry
canonical form: prostration
sense: 14089685-n
part of speech: noun

14089685-n
type: LexicalConcept
in scheme: en-word.net
definition: an abrupt failure of function or complete physical exhaustion
example: the commander's prostration demoralized his men
ili: i110850
lexfile: noun.state
part of speech: noun
hypernym: 14085287-n