drug addiction-n
type: LexicalEntry
canonical form: drug addiction
sense: 14087890-n
part of speech: noun

white plague-n
type: LexicalEntry
canonical form: white plague
sense: 14087890-n
part of speech: noun

14087890-n
type: LexicalConcept
in scheme: en-word.net
definition: an addiction to a drug (especially a narcotic drug)
ili: i110839
lexfile: noun.state
part of speech: noun
domain topic: 03814104-n
hypernym: 14086207-n