biliousness-n
type: LexicalEntry
canonical form: biliousness
sense: 14086047-n
part of speech: noun

14086047-n
type: LexicalConcept
in scheme: en-word.net
definition: gastric distress caused by a disorder of the liver or gall bladder
ili: i110829
lexfile: noun.state
part of speech: noun
hypernym: 14075528-n