sensation-n
type: LexicalEntry
canonical form: sensation
sense: 14060962-n
part of speech: noun

14060962-n
type: LexicalConcept
in scheme: en-word.net
definition: a state of widespread public excitement and interest
example: the news caused a sensation
ili: i110696
lexfile: noun.state
part of speech: noun
hypernym: 14060493-n