sleep-n
type: LexicalEntry
canonical form: sleep
sense: 14048353-n
part of speech: noun

slumber-n
type: LexicalEntry
canonical form: slumber
sense: 14048353-n
part of speech: noun

14048353-n
type: LexicalConcept
in scheme: en-word.net
definition: a natural and periodic state of rest during which consciousness of the world is suspended
example: he didn't get enough sleep last night
example: calm as a child in dreamless slumber
ili: i110638
lexfile: noun.state
part of speech: noun
hypernym: 14057659-n