operation-n
type: LexicalEntry
canonical form: operation
sense: 14032291-n
part of speech: noun

14032291-n
type: LexicalConcept
in scheme: en-word.net
definition: the state of being in effect or being operative
example: that rule is no longer in operation
ili: i110549
lexfile: noun.state
part of speech: noun
hypernym: 14030430-n