agency-n
type: LexicalEntry
canonical form: agency
sense: 14031031-n
part of speech: noun

14031031-n
type: LexicalConcept
in scheme: en-word.net
definition: the state of being in action or exerting power
example: the agency of providence
example: she has free agency
ili: i110543
lexfile: noun.state
part of speech: noun
hypernym: 14030430-n