innocence-n
type: LexicalEntry
canonical form: innocence
sense: 14013112-n
part of speech: noun

14013112-n
type: LexicalConcept
in scheme: en-word.net
definition: a state or condition of being innocent of a specific crime or offense
example: the trial established his innocence
ili: i110451
lexfile: noun.state
part of speech: noun
hypernym: 13943868-n