obscurity-n
type: LexicalEntry
canonical form: obscurity
sense: 14009156-n
part of speech: noun

obscureness-n
type: LexicalEntry
canonical form: obscureness
sense: 14009156-n
part of speech: noun

14009156-n
type: LexicalConcept
in scheme: en-word.net
definition: the state of being indistinct or indefinite for lack of adequate illumination
ili: i110433
lexfile: noun.state
part of speech: noun
hypernym: 14007770-n