divide-n
type: LexicalEntry
canonical form: divide
sense: 14006177-n
part of speech: noun

14006177-n
type: LexicalConcept
in scheme: en-word.net
definition: a serious disagreement between two groups of people (typically producing tension or hostility)
ili: i110416
lexfile: noun.state
part of speech: noun
hypernym: 14005842-n