rioting-n
type: LexicalEntry
canonical form: rioting
sense: 14000490-n
part of speech: noun

riot-n
type: LexicalEntry
canonical form: riot
sense: 14000490-n
part of speech: noun

14000490-n
type: LexicalConcept
in scheme: en-word.net
definition: a state of disorder involving group violence
ili: i110387
lexfile: noun.state
part of speech: noun
hypernym: 13996244-n