mollification-n
type: LexicalEntry
canonical form: mollification
sense: 13994211-n
part of speech: noun

13994211-n
type: LexicalConcept
in scheme: en-word.net
definition: a state of being appeased or ameliorated or tempered
ili: i110354
lexfile: noun.state
part of speech: noun
hypernym: 13994031-n