peace-n
type: LexicalEntry
canonical form: peace
sense: 13993683-n
part of speech: noun

13993683-n
type: LexicalConcept
in scheme: en-word.net
definition: the state prevailing during the absence of war
ili: i110351
lexfile: noun.state
part of speech: noun
hypernym: 13991994-n