peace-n
type: LexicalEntry
canonical form: peace
sense: 13993147-n
part of speech: noun

13993147-n
type: LexicalConcept
in scheme: en-word.net
definition: harmonious relations; freedom from disputes
example: the roommates lived in peace together
ili: i110347
lexfile: noun.state
part of speech: noun
hypernym: 13992690-n