order-n
type: LexicalEntry
canonical form: order
sense: 13991994-n
part of speech: noun

13991994-n
type: LexicalConcept
in scheme: en-word.net
definition: established customary state (especially of society)
example: order ruled in the streets
example: law and order
ili: i110342
lexfile: noun.state
part of speech: noun
hypernym: 00024900-n