death-n
type: LexicalEntry
canonical form: death
sense: 13985834-n
part of speech: noun

13985834-n
type: LexicalConcept
in scheme: en-word.net
definition: the absence of life or state of being dead
example: he seemed more content in death than he had ever been in life
ili: i110309
lexfile: noun.state
part of speech: noun
hypernym: 00024900-n