standing-n
type: LexicalEntry
canonical form: standing
sense: 13971316-n
part of speech: noun

13971316-n
type: LexicalConcept
in scheme: en-word.net
definition: social or financial or professional status or reputation
example: of equal standing
example: a member in good standing
ili: i110236
lexfile: noun.state
part of speech: noun
hypernym: 13968971-n