homelessness-n
type: LexicalEntry
canonical form: homelessness
sense: 13966105-n
part of speech: noun

13966105-n
type: LexicalConcept
in scheme: en-word.net
definition: the state or condition of having no home (especially the state of living in the streets)
ili: i110213
lexfile: noun.state
part of speech: noun
hypernym: 13943868-n