crunch-n
type: LexicalEntry
canonical form: crunch
sense: 13957103-n
part of speech: noun

13957103-n
type: LexicalConcept
in scheme: en-word.net
definition: a critical situation that arises because of a shortage (as a shortage of time or money or resources)
example: an end-of-the-year crunch
example: a financial crunch
ili: i110167
lexfile: noun.state
part of speech: noun
hypernym: 14434647-n