crisis-n
type: LexicalEntry
canonical form: crisis
sense: 13956593-n
part of speech: noun

13956593-n
type: LexicalConcept
in scheme: en-word.net
definition: an unstable situation of extreme danger or difficulty
example: they went bankrupt during the economic crisis
ili: i110165
lexfile: noun.state
part of speech: noun
attribute: https://en-word.net/synset/00653599-a
attribute: https://en-word.net/synset/00654719-a
hypernym: 14434647-n