complication-n
type: LexicalEntry
canonical form: complication
sense: 13956254-n
part of speech: noun

13956254-n
type: LexicalConcept
in scheme: en-word.net
definition: a situation or condition that is complex or confused
example: her coming was a serious complication
ili: i110163
lexfile: noun.state
part of speech: noun
hypernym: 13950416-n