situation-n
type: LexicalEntry
canonical form: situation
sense: 13948785-n
part of speech: noun

position-n
type: LexicalEntry
canonical form: position
sense: 13948785-n
part of speech: noun

13948785-n
type: LexicalConcept
in scheme: en-word.net
definition: a condition or position in which you find yourself
example: the unpleasant situation (or position) of having to choose between two evils
example: found herself in a very fortunate situation
ili: i110126
lexfile: noun.state
part of speech: noun
hypernym: 13943868-n