tail-n
type: LexicalEntry
canonical form: tail
sense: 13941307-n
part of speech: noun

tail end-n
type: LexicalEntry
canonical form: tail end
sense: 13941307-n
part of speech: noun

13941307-n
type: LexicalConcept
in scheme: en-word.net
definition: any projection that resembles the tail of an animal
ili: i110093
lexfile: noun.shape
part of speech: noun
hypernym: 13942718-n